rowid,Title,Title_label,Release Year,Release Year_label,Locations,Fun Facts,Production Company,Production Company_label,Distributor,Distributor_label,Director,Director_label,Writer,Writer_label,Actor 1,Actor 1_label,Actor 2,Actor 2_label,Actor 3,Actor 3_label
9,2,24 Hours on Craigslist,2,2005,,,2,Yerba Buena Productions,1,Zealot Pictures,2,Michael Ferris Gibson,,,238,Craig Newmark,,,,
126,32,Bee Season,2,2005,,,28,Bee Season Productions,24,Fox Searchlight Pictures,30,Scott McGehee,29,David Siegel,264,Richard Gere,28,Juliette Binoche,,
730,143,Just Like Heaven,2,2005,,,84,DreamWorks SKG,59,DreamWorks Distribution,131,Mark Waters,132,Peter Tolan,335,Reese Witherspoon,118,Mark Ruffalo,,
975,176,Night of Henna,2,2005,,,111,Zee Films,70,Illuminare Entertainment,149,Hassan Zee,153,Hassan Zee,346,Joyce Carlin,133,Nancy Carlin,,
1083,202,Rent,2,2005,Treasure Island,"An artificial island, Treasure Island was created for the 1939 Golden Gate International Exposition, and is named after the novel by Robert Louis Stevenson, a one-time San Francisco resident.",127,Rent Productions LLC,4,Columbia Pictures,31,Chris Columbus,175,Stephen Chbosky,369,Anthony Rapp,155,Rosario Dawson,,
1330,246,The Californians,2,2005,,,149,Parker Film Company,107,Fabrication Films,202,Jonathan Parker,213,Jonathan Parker & Catherine DiNapoli,396,Noah Wyle,,,,
1515,286,The Zodiac,2,2005,,,167,Blackwater Films,104,THINKFilm,234,Alexander Bulkley,247,Alexander Bulkley & Kelley Bulkeley,423,Justin Chambers,44,Robin Tunney,,
1546,294,Tweek City,2,2005,,,171,Tweek City LLC,116,Maverick Entertainment Group,239,Eric G. Johnson,254,Eric G. Johnson,429,Giuseppe Andrews,,,,
